Target
Signal transducer and activator of transcription 1-alpha/beta
Ligand
BDBM43453
Substrate
Meas. Tech.
Dose response cell-based assay to measure STAT1 inhibition
IC50
11090±n/a nM
Citation
 PubChem, PC Dose response cell-based assay to measure STAT1 inhibition PubChem Bioassay (2008)[AID] 
Target
Name:
Signal transducer and activator of transcription 1-alpha/beta
Synonyms:
STAT1 Signal transducer and activator of transcription 1-alpha/beta Transcription factor ISGF-3 components p91/p84 | signal transducer and activator of transcription 1 isoform alpha
Type:
Cytosolic Transcription Factor
Mol. Mass.:
87327.69
Organism:
Homo sapiens (Human)
Description:
Stat1 was expressed in sf9 cells from a baculovirus encoding the recombinant proteins. Stat1 dimer binds to DNA.
Residue:
750
  
Inhibitor
Name:
BDBM43453
Synonyms:
MLS000729576 N-(2-chloro-3-pyridinyl)-4-[[4-(3,4-dimethoxyphenyl)-6-(trifluoromethyl)-2-pyrimidinyl]sulfonyl]butanamide N-(2-chloropyridin-3-yl)-4-[4-(3,4-dimethoxyphenyl)-6-(trifluoromethyl)pyrimidin-2-yl]sulfonylbutanamide SMR000307853 | cid_5080789
Type:
Small organic molecule
Emp. Form.:
C22H20ClF3N4O5S
Mol. Mass.:
544.931
SMILES:
COc1ccc(cc1OC)-c1cc(nc(n1)S(=O)(=O)CCCC(=O)Nc1cccnc1Cl)C(F)(F)F
: