Target
Signal transducer and activator of transcription 1-alpha/beta
Ligand
BDBM43534
Substrate
Meas. Tech.
Dose response cell-based assay to measure STAT1 inhibition
IC50
10480±n/a nM
Citation
 PubChem, PC Dose response cell-based assay to measure STAT1 inhibition PubChem Bioassay (2008)[AID] 
Target
Name:
Signal transducer and activator of transcription 1-alpha/beta
Synonyms:
STAT1 Signal transducer and activator of transcription 1-alpha/beta Transcription factor ISGF-3 components p91/p84 | signal transducer and activator of transcription 1 isoform alpha
Type:
Cytosolic Transcription Factor
Mol. Mass.:
87327.69
Organism:
Homo sapiens (Human)
Description:
Stat1 was expressed in sf9 cells from a baculovirus encoding the recombinant proteins. Stat1 dimer binds to DNA.
Residue:
750
  
Inhibitor
Name:
BDBM43534
Synonyms:
MLS000692834 N-[[(Z)-2-bromo-3-phenyl-prop-2-enylidene]amino]-5-keto-4-methyl-2-pyrazoline-3-carboxamide SMR000285172 | cid_16195082
Type:
Small organic molecule
Emp. Form.:
C14H13BrN4O2
Mol. Mass.:
349.183
SMILES:
Cc1c([nH][nH]c1=O)C(=O)NN=CC(Br)=Cc1ccccc1
: