Target
Signal transducer and activator of transcription 1-alpha/beta
Ligand
BDBM43537
Substrate
Meas. Tech.
Dose response cell-based assay to measure STAT1 inhibition
IC50
42630±n/a nM
Citation
 PubChem, PC Dose response cell-based assay to measure STAT1 inhibition PubChem Bioassay (2008)[AID] 
Target
Name:
Signal transducer and activator of transcription 1-alpha/beta
Synonyms:
STAT1 Signal transducer and activator of transcription 1-alpha/beta Transcription factor ISGF-3 components p91/p84 | signal transducer and activator of transcription 1 isoform alpha
Type:
Cytosolic Transcription Factor
Mol. Mass.:
87327.69
Organism:
Homo sapiens (Human)
Description:
Stat1 was expressed in sf9 cells from a baculovirus encoding the recombinant proteins. Stat1 dimer binds to DNA.
Residue:
750
  
Inhibitor
Name:
BDBM43537
Synonyms:
(7-chloroquinazolin-4-yl)-veratryl-amine 7-chloro-N-(3,4-dimethoxybenzyl)-4-quinazolinamine 7-chloro-N-[(3,4-dimethoxyphenyl)methyl]quinazolin-4-amine SMR000335341 | cid_1490529
Type:
Small organic molecule
Emp. Form.:
C17H16ClN3O2
Mol. Mass.:
329.781
SMILES:
COc1ccc(CNc2ncnc3cc(Cl)ccc23)cc1OC
: