Target
Signal transducer and activator of transcription 3 [702-738,740-752]
Ligand
BDBM43550
Substrate
Meas. Tech.
Dose response cell-based assay to measure STAT3 activation
IC50
3326±n/a nM
Citation
 PubChem, PC Dose response cell-based assay to measure STAT3 activation PubChem Bioassay (2008)[AID] 
Target
Name:
Signal transducer and activator of transcription 3 [702-738,740-752]
Synonyms:
APRF STAT3_HUMAN
Type:
Enzyme Catalytic Domain
Mol. Mass.:
5263.93
Organism:
Homo sapiens (Human)
Description:
gi_13272532
Residue:
50
  
Inhibitor
Name:
BDBM43550
Synonyms:
1H-indazole-3-carboxylic acid methyl ester SMR000038274 methyl 1H-indazole-3-carboxylate
Type:
Small organic molecule
Emp. Form.:
C9H8N2O2
Mol. Mass.:
176.172
SMILES:
COC(=O)c1n[nH]c2ccccc12
: