Target
Signal transducer and activator of transcription 3 [702-738,740-752]
Ligand
BDBM43554
Substrate
Meas. Tech.
Dose response cell-based assay to measure STAT3 activation
IC50
>2060±n/a nM
Citation
 PubChem, PC Dose response cell-based assay to measure STAT3 activation PubChem Bioassay (2008)[AID] 
Target
Name:
Signal transducer and activator of transcription 3 [702-738,740-752]
Synonyms:
APRF STAT3_HUMAN
Type:
Enzyme Catalytic Domain
Mol. Mass.:
5263.93
Organism:
Homo sapiens (Human)
Description:
gi_13272532
Residue:
50
  
Inhibitor
Name:
BDBM43554
Synonyms:
MLS000078111 N-(5-chloro-2-hydroxy-phenyl)-2-methoxy-benzamide SMR000037335 | cid_483833
Type:
Small organic molecule
Emp. Form.:
C14H12ClNO3
Mol. Mass.:
277.703
SMILES:
COc1ccccc1C(=O)Nc1cc(Cl)ccc1O
: