Target
Signal transducer and activator of transcription 3 [702-738,740-752]
Ligand
BDBM43557
Substrate
Meas. Tech.
Dose response cell-based assay to measure STAT3 activation
IC50
3397±n/a nM
Citation
 PubChem, PC Dose response cell-based assay to measure STAT3 activation PubChem Bioassay (2008)[AID] 
Target
Name:
Signal transducer and activator of transcription 3 [702-738,740-752]
Synonyms:
APRF STAT3_HUMAN
Type:
Enzyme Catalytic Domain
Mol. Mass.:
5263.93
Organism:
Homo sapiens (Human)
Description:
gi_13272532
Residue:
50
  
Inhibitor
Name:
BDBM43557
Synonyms:
2-methyl-3-quinolinol MLS000079429 cid_594394
Type:
Small organic molecule
Emp. Form.:
C10H9NO
Mol. Mass.:
159.1846
SMILES:
Cc1nc2ccccc2cc1O
: