Target
Signal transducer and activator of transcription 3 [702-738,740-752]
Ligand
BDBM43560
Substrate
Meas. Tech.
Dose response cell-based assay to measure STAT3 activation
IC50
>25.5±n/a nM
Citation
 PubChem, PC Dose response cell-based assay to measure STAT3 activation PubChem Bioassay (2008)[AID] 
Target
Name:
Signal transducer and activator of transcription 3 [702-738,740-752]
Synonyms:
APRF STAT3_HUMAN
Type:
Enzyme Catalytic Domain
Mol. Mass.:
5263.93
Organism:
Homo sapiens (Human)
Description:
gi_13272532
Residue:
50
  
Inhibitor
Name:
BDBM43560
Synonyms:
4-acetyl-N-(2-methoxyphenyl)-3,5-dimethyl-1H-pyrrole-2-carboxamide MLS000058689 cid_2115839
Type:
Small organic molecule
Emp. Form.:
C16H18N2O3
Mol. Mass.:
286.3257
SMILES:
COc1ccccc1NC(=O)c1[nH]c(C)c(C(C)=O)c1C
: