Target
Signal transducer and activator of transcription 3 [702-738,740-752]
Ligand
BDBM30930
Substrate
Meas. Tech.
Dose response cell-based assay to measure STAT3 activation
IC50
>2060±n/a nM
Citation
 PubChem, PC Dose response cell-based assay to measure STAT3 activation PubChem Bioassay (2008)[AID] 
Target
Name:
Signal transducer and activator of transcription 3 [702-738,740-752]
Synonyms:
APRF STAT3_HUMAN
Type:
Enzyme Catalytic Domain
Mol. Mass.:
5263.93
Organism:
Homo sapiens (Human)
Description:
gi_13272532
Residue:
50
  
Inhibitor
Name:
BDBM30930
Synonyms:
3-(4,5,6,7-tetrahydrobenzothiophene-2-carbonylamino)thiophene-2-carboxylic acid methyl ester MLS000051746 cid_1246875 methyl 3-(4,5,6,7-tetrahydro-1-benzothiophene-2-carbonylamino)thiophene-2-carboxylate | methyl 3-[(4,5,6,7-tetrahydro-1-benzothien-2-ylcarbonyl)amino]-2-thiophenecarboxylate
Type:
Small organic molecule
Emp. Form.:
C15H15NO3S2
Mol. Mass.:
321.415
SMILES:
COC(=O)c1sccc1NC(=O)c1cc2CCCCc2s1
: