Target
Signal transducer and activator of transcription 3 [702-738,740-752]
Ligand
BDBM43584
Substrate
Meas. Tech.
Dose response cell-based assay to measure STAT3 activation
IC50
>8.49±n/a nM
Citation
 PubChem, PC Dose response cell-based assay to measure STAT3 activation PubChem Bioassay (2008)[AID] 
Target
Name:
Signal transducer and activator of transcription 3 [702-738,740-752]
Synonyms:
APRF STAT3_HUMAN
Type:
Enzyme Catalytic Domain
Mol. Mass.:
5263.93
Organism:
Homo sapiens (Human)
Description:
gi_13272532
Residue:
50
  
Inhibitor
Name:
BDBM43584
Synonyms:
2-[(1-methyl-2-benzimidazolyl)methylamino]phenol MLS000116137 cid_873059
Type:
Small organic molecule
Emp. Form.:
C15H15N3O
Mol. Mass.:
253.2991
SMILES:
Cn1c(CNc2ccccc2O)nc2ccccc12
: