Target
Signal transducer and activator of transcription 3 [702-738,740-752]
Ligand
BDBM43585
Substrate
Meas. Tech.
Dose response cell-based assay to measure STAT3 activation
IC50
3777±n/a nM
Citation
 PubChem, PC Dose response cell-based assay to measure STAT3 activation PubChem Bioassay (2008)[AID] 
Target
Name:
Signal transducer and activator of transcription 3 [702-738,740-752]
Synonyms:
APRF STAT3_HUMAN
Type:
Enzyme Catalytic Domain
Mol. Mass.:
5263.93
Organism:
Homo sapiens (Human)
Description:
gi_13272532
Residue:
50
  
Inhibitor
Name:
BDBM43585
Synonyms:
3-(4-chlorophenyl)-1-methyl-N-[3-(4-methyl-1-piperazinyl)propyl]-5-thieno[2,3-c]pyrazolecarboxamide 3-(4-chlorophenyl)-1-methyl-N-[3-(4-methylpiperazino)propyl]thieno[2,3-c]pyrazole-5-carboxamide SMR000094249 | cid_5308230
Type:
Small organic molecule
Emp. Form.:
C21H26ClN5OS
Mol. Mass.:
431.982
SMILES:
CN1CCN(CCCNC(=O)c2cc3c(nn(C)c3s2)-c2ccc(Cl)cc2)CC1
: