Target
Signal transducer and activator of transcription 3 [702-738,740-752]
Ligand
BDBM43595
Substrate
Meas. Tech.
Dose response cell-based assay to measure STAT3 activation
IC50
>76±n/a nM
Citation
 PubChem, PC Dose response cell-based assay to measure STAT3 activation PubChem Bioassay (2008)[AID] 
Target
Name:
Signal transducer and activator of transcription 3 [702-738,740-752]
Synonyms:
APRF STAT3_HUMAN
Type:
Enzyme Catalytic Domain
Mol. Mass.:
5263.93
Organism:
Homo sapiens (Human)
Description:
gi_13272532
Residue:
50
  
Inhibitor
Name:
BDBM43595
Synonyms:
MLS000104263 N-(1-acetyl-2-chloro-indol-3-yl)acetamide N-(2-chloranyl-1-ethanoyl-indol-3-yl)ethanamide cid_788168
Type:
Small organic molecule
Emp. Form.:
C12H11ClN2O2
Mol. Mass.:
250.681
SMILES:
CC(=O)Nc1c(Cl)n(C(C)=O)c2ccccc12
: