Target
Signal transducer and activator of transcription 3 [702-738,740-752]
Ligand
BDBM43604
Substrate
Meas. Tech.
Dose response cell-based assay to measure STAT3 activation
IC50
>76±n/a nM
Citation
 PubChem, PC Dose response cell-based assay to measure STAT3 activation PubChem Bioassay (2008)[AID] 
Target
Name:
Signal transducer and activator of transcription 3 [702-738,740-752]
Synonyms:
APRF STAT3_HUMAN
Type:
Enzyme Catalytic Domain
Mol. Mass.:
5263.93
Organism:
Homo sapiens (Human)
Description:
gi_13272532
Residue:
50
  
Inhibitor
Name:
BDBM43604
Synonyms:
MLS000522376 N-(4-chloro-2,5-dimethoxy-phenyl)-5-cyclopropyl-isoxazole-3-carboxamide N-(4-chloro-2,5-dimethoxyphenyl)-5-cyclopropyl-3-isoxazolecarboxamide cid_6619100
Type:
Small organic molecule
Emp. Form.:
C15H15ClN2O4
Mol. Mass.:
322.744
SMILES:
COc1cc(NC(=O)c2cc(on2)C2CC2)c(OC)cc1Cl
: