Target
Signal transducer and activator of transcription 3 [702-738,740-752]
Ligand
BDBM43633
Substrate
Meas. Tech.
Dose response cell-based assay to measure STAT3 activation
IC50
6032±n/a nM
Citation
 PubChem, PC Dose response cell-based assay to measure STAT3 activation PubChem Bioassay (2008)[AID] 
Target
Name:
Signal transducer and activator of transcription 3 [702-738,740-752]
Synonyms:
APRF STAT3_HUMAN
Type:
Enzyme Catalytic Domain
Mol. Mass.:
5263.93
Organism:
Homo sapiens (Human)
Description:
gi_13272532
Residue:
50
  
Inhibitor
Name:
BDBM43633
Synonyms:
MLS000679832 N-[[(2-methoxyphenyl)-oxomethyl]amino]carbamic acid methyl ester cid_2237211 methyl N-[(2-methoxybenzoyl)amino]carbamate | methyl N-[(2-methoxyphenyl)carbonylamino]carbamate
Type:
Small organic molecule
Emp. Form.:
C10H12N2O4
Mol. Mass.:
224.2133
SMILES:
COC(=O)NNC(=O)c1ccccc1OC
: