Target
Signal transducer and activator of transcription 3 [702-738,740-752]
Ligand
BDBM43655
Substrate
Meas. Tech.
Dose response cell-based assay to measure STAT3 activation
IC50
635±n/a nM
Citation
 PubChem, PC Dose response cell-based assay to measure STAT3 activation PubChem Bioassay (2008)[AID] 
Target
Name:
Signal transducer and activator of transcription 3 [702-738,740-752]
Synonyms:
APRF STAT3_HUMAN
Type:
Enzyme Catalytic Domain
Mol. Mass.:
5263.93
Organism:
Homo sapiens (Human)
Description:
gi_13272532
Residue:
50
  
Inhibitor
Name:
BDBM43655
Synonyms:
(3Z)-3-[(4-bromanylthiophen-2-yl)methylidene]-1-methyl-indol-2-one (3Z)-3-[(4-bromo-2-thiophenyl)methylidene]-1-methyl-2-indolone MLS000770538 cid_2109452
Type:
Small organic molecule
Emp. Form.:
C14H10BrNOS
Mol. Mass.:
320.204
SMILES:
CN1C(=O)\C(=C/c2cc(Br)cs2)c2ccccc12
: