Target
Alkaline phosphatase, tissue-nonspecific isozyme
Ligand
BDBM43802
Substrate
Meas. Tech.
SAR assay for compounds activating TNAP in the absence of phosphate acceptor performed in a luminescent assay
EC50
34700±n/a nM
Citation
 PubChem, PC SAR assay for compounds activating TNAP in the absence of phosphate acceptor performed in a luminescent assay PubChem Bioassay (2010)[AID] 
Target
Name:
Alkaline phosphatase, tissue-nonspecific isozyme
Synonyms:
ALPL tissue-nonspecific alkaline phosphatase precursor
Type:
PROTEIN
Mol. Mass.:
57306.17
Organism:
Homo sapiens (Human)
Description:
ChEMBL_1448917
Residue:
524
  
Inhibitor
Name:
BDBM43802
Synonyms:
MLS-0255229.0001 N-[[(1-oxo-2,2-diphenylethyl)hydrazo]-sulfanylidenemethyl]acetamide N-[[(2,2-diphenylacetyl)amino]thiocarbamoyl]acetamide | cid_3138367
Type:
Small organic molecule
Emp. Form.:
C17H17N3O2S
Mol. Mass.:
327.401
SMILES:
CC(=O)NC(=S)NNC(=O)C(c1ccccc1)c1ccccc1
: