Target
Solute carrier family 12 member 5
Ligand
BDBM43868
Substrate
Meas. Tech.
Identification of Novel Modulators of Cl- dependent Transport Process via HTS: Dose-Dependent Assay 2 with KCC2
EC50
13300±n/a nM
Citation
 PubChem, PC Identification of Novel Modulators of Cl- dependent Transport Process via HTS: Dose-Dependent Assay 2 with KCC2 PubChem Bioassay (2009)[AID] 
Target
Name:
Solute carrier family 12 member 5
Synonyms:
Electroneutral potassium-chloride cotransporter 2 KCC2 Neuronal K-Cl cotransporter SLC12A5 electroneutral potassium-chloride cotransporter KCC2 | hKCC2
Type:
PROTEIN
Mol. Mass.:
126185.18
Organism:
Homo sapiens (Human)
Description:
ChEMBL_828024
Residue:
1139
  
Inhibitor
Name:
BDBM43868
Synonyms:
3-[2-[4-[bis(4-fluorophenyl)methylene]piperidino]ethyl]-2-thioxo-1H-quinazolin-4-one 3-[2-[4-[bis(4-fluorophenyl)methylidene]piperidin-1-yl]ethyl]-2-sulfanylidene-1H-quinazolin-4-one MLS000069510 SMR000058550 | cid_657356
Type:
Small organic molecule
Emp. Form.:
C28H25F2N3OS
Mol. Mass.:
489.579
SMILES:
Fc1ccc(cc1)C(=C1CCN(CCn2c(=S)[nH]c3ccccc3c2=O)CC1)c1ccc(F)cc1
: