Target
Ephrin type-A receptor 4
Ligand
BDBM44454
Substrate
Meas. Tech.
Colorimetric assay for HTS discovery of chemical inhibitors of EphA4 receptor antagonists
IC50
>100000±n/a nM
Citation
 PubChem, PC Colorimetric assay for HTS discovery of chemical inhibitors of EphA4 receptor antagonists PubChem Bioassay (2008)[AID] 
Target
Name:
Ephrin type-A receptor 4
Synonyms:
EPHA4_MOUSE Epha4 Sek1
Type:
Enzyme Catalytic Domain
Mol. Mass.:
109812.17
Organism:
Mus musculus
Description:
gi_34328113
Residue:
986
  
Inhibitor
Name:
BDBM44454
Synonyms:
2-(2-furanylmethylidene)-5-(3-methoxyphenyl)-7-methyl-3-oxo-5H-thiazolo[3,2-a]pyrimidine-6-carboxylic acid ethyl ester MLS000108373 cid_2879747 ethyl 2-(furan-2-ylmethylidene)-5-(3-methoxyphenyl)-7-methyl-3-oxo-5H-[1,3]thiazolo[3,2-a]pyrimidine-6-carboxylate
Type:
Small organic molecule
Emp. Form.:
C22H20N2O5S
Mol. Mass.:
424.47
SMILES:
CCOC(=O)C1=C(C)N=c2sc(=Cc3ccco3)c(=O)n2C1c1cccc(OC)c1
: