Target
Gag-Pol polyprotein [600-1027,R876K]/[600-1155]
Ligand
BDBM2014
Substrate
poly(rC)500:oligo(dG)10
Meas. Tech.
HIV-1 RT Assay
pH
7.8±n/a
Temperature
295.15±n/a K
IC50
28±n/a nM
Citation
 Kelly, TAMcNeil, DWRose, JMDavid, EShih, CKGrob, PM Novel non-nucleoside inhibitors of human immunodeficiency virus type 1 reverse transcriptase. 6. 2-Indol-3-yl- and 2-azaindol-3-yl-dipyridodiazepinones. J Med Chem 40:2430-3 (1997)  
Target
Name:
Gag-Pol polyprotein [600-1027,R876K]/[600-1155]
Synonyms:
EC: 2.7.7.49 | HIV-1 Reverse Transcriptase
Type:
Protein Complex
Mol. Mass.:
113858
Description:
Components:
This complex has 2 components.
Component 1
Name:
Gag-Pol polyprotein [600-1155]
Synonyms:
HIV-1 Reverse Transcriptase Chain A gag-pol
Type:
Enzyme Subunit
Mol. Mass.:
63928.81
Organism:
Human immunodeficiency virus type 1
Description:
P03366[600-1155]
Residue:
556
  
Component 2
Name:
Gag-Pol polyprotein [600-1027,R876K]
Synonyms:
HIV-1 Reverse Transcriptase Chain B gag-pol
Type:
Enzyme Subunit
Mol. Mass.:
49968.63
Organism:
Human immunodeficiency virus type 1
Description:
P03366[600-1027,R876K]
Residue:
428
  
Inhibitor
Name:
BDBM2014
Synonyms:
2-ethyl-5-(1H-indol-3-yl)-9-methyl-2,4,9,15-tetraazatricyclo[9.4.0.0^{3,8}]pentadeca-1(11),3(8),4,6,12,14-hexaen-10-one 5,11-Dihydro-11-ethyl-2-indol-3-yl-5-methyl-6H-dipyrido[3,2-b:2 ,3 -e][1,4]diazepin-6-one
Type:
Small organic molecule
Emp. Form.:
C22H19N5O
Mol. Mass.:
369.4192
SMILES:
CCN1c2nc(ccc2N(C)C(=O)c2cccnc12)-c1c[nH]c2ccccc12
:
Substrate
Name:
poly(rC)500:oligo(dG)10
Synonyms:
Type:
RNA\DNA duplex
Mol. Mass.:
358.43
Organism:
Description:
The incorporation of Tritium-labeled dGTP onto a (poly)rC:(oligo)dG template:primer.
Residue:
3
NA