Target
Multidrug resistance-associated protein 1
Ligand
BDBM44606
Substrate
Meas. Tech.
Identification of Molecular Probes that Activate MRP-1 - Dose Response
EC50
4933±n/a nM
Citation
 PubChem, PC Identification of Molecular Probes that Activate MRP-1 - Dose Response PubChem Bioassay (2007)[AID] 
Target
Name:
Multidrug resistance-associated protein 1
Synonyms:
7.6.2.2 ABCC1 ATP-binding cassette, sub-family C, member 1 isoform 1 LTC4 transporter MRP MRP1_HUMAN
Type:
Mol. Mass.:
171597.72
Organism:
Homo sapiens (Human)
Description:
P33527
Residue:
1531
  
Inhibitor
Name:
BDBM44606
Synonyms:
5-(4-bromophenyl)-7-thiophen-2-yl-1,5,6,7-tetrahydro-[1,2,4]triazolo[1,5-a]pyrimidin-2-amine SMR000035934 cid_5389550
Type:
Small organic molecule
Emp. Form.:
C15H14BrN5S
Mol. Mass.:
376.274
SMILES:
Nc1nc2NC(CC(c3cccs3)n2n1)c1ccc(Br)cc1
: