Target
Multidrug resistance-associated protein 1
Ligand
BDBM32048
Substrate
Meas. Tech.
Identification of Molecular Probes that Activate MRP-1 - Dose Response
EC50
7700±n/a nM
Citation
 PubChem, PC Identification of Molecular Probes that Activate MRP-1 - Dose Response PubChem Bioassay (2007)[AID] 
Target
Name:
Multidrug resistance-associated protein 1
Synonyms:
7.6.2.2 ABCC1 ATP-binding cassette, sub-family C, member 1 isoform 1 LTC4 transporter MRP MRP1_HUMAN
Type:
Mol. Mass.:
171597.72
Organism:
Homo sapiens (Human)
Description:
P33527
Residue:
1531
  
Inhibitor
Name:
BDBM32048
Synonyms:
MLS000042345 N-[(2S)-1-(1,3-benzodioxol-5-ylamino)-1-oxidanylidene-propan-2-yl]-1-(4-methylphenyl)sulfonyl-piperidine-4-carboxamide N-[(2S)-1-(1,3-benzodioxol-5-ylamino)-1-oxopropan-2-yl]-1-(4-methylphenyl)sulfonylpiperidine-4-carboxamide cid_5389688
Type:
Small organic molecule
Emp. Form.:
C23H27N3O6S
Mol. Mass.:
473.542
SMILES:
C[C@H](NC(=O)C1CCN(CC1)S(=O)(=O)c1ccc(C)cc1)C(=O)Nc1ccc2OCOc2c1
: