Target
Multidrug resistance-associated protein 1
Ligand
BDBM44609
Substrate
Meas. Tech.
Identification of Molecular Probes that Activate MRP-1 - Dose Response
EC50
1987±n/a nM
Citation
 PubChem, PC Identification of Molecular Probes that Activate MRP-1 - Dose Response PubChem Bioassay (2007)[AID] 
Target
Name:
Multidrug resistance-associated protein 1
Synonyms:
7.6.2.2 ABCC1 ATP-binding cassette, sub-family C, member 1 isoform 1 LTC4 transporter MRP MRP1_HUMAN
Type:
Mol. Mass.:
171597.72
Organism:
Homo sapiens (Human)
Description:
P33527
Residue:
1531
  
Inhibitor
Name:
BDBM44609
Synonyms:
5-(3,4-dihydro-1H-isoquinolin-2-yl)-2-(2-methoxyphenyl)-1,3-oxazole-4-carbonitrile 5-(3,4-dihydro-1H-isoquinolin-2-yl)-2-(2-methoxyphenyl)oxazole-4-carbonitrile SMR000044165 | cid_663473
Type:
Small organic molecule
Emp. Form.:
C20H17N3O2
Mol. Mass.:
331.3679
SMILES:
COc1ccccc1-c1nc(C#N)c(o1)N1CCc2ccccc2C1
: