Target
Multidrug resistance-associated protein 1
Ligand
BDBM31697
Substrate
Meas. Tech.
Identification of Molecular Probes that Activate MRP-1 - Dose Response
EC50
8279±n/a nM
Citation
 PubChem, PC Identification of Molecular Probes that Activate MRP-1 - Dose Response PubChem Bioassay (2007)[AID] 
Target
Name:
Multidrug resistance-associated protein 1
Synonyms:
7.6.2.2 ABCC1 ATP-binding cassette, sub-family C, member 1 isoform 1 LTC4 transporter MRP MRP1_HUMAN
Type:
Mol. Mass.:
171597.72
Organism:
Homo sapiens (Human)
Description:
P33527
Residue:
1531
  
Inhibitor
Name:
BDBM31697
Synonyms:
4-[4-[2-(4-methylphenoxy)ethyl]-1-piperazinyl]-N-(5-methyl-1,3,4-thiadiazol-2-yl)-4-oxobutanamide 4-[4-[2-(4-methylphenoxy)ethyl]piperazin-1-yl]-N-(5-methyl-1,3,4-thiadiazol-2-yl)-4-oxobutanamide MLS000082798 cid_663757
Type:
Small organic molecule
Emp. Form.:
C20H27N5O3S
Mol. Mass.:
417.525
SMILES:
Cc1nnc(NC(=O)CCC(=O)N2CCN(CCOc3ccc(C)cc3)CC2)s1
: