Target
Multidrug resistance-associated protein 1
Ligand
BDBM44611
Substrate
Meas. Tech.
Identification of Molecular Probes that Activate MRP-1 - Dose Response
EC50
4090±n/a nM
Citation
 PubChem, PC Identification of Molecular Probes that Activate MRP-1 - Dose Response PubChem Bioassay (2007)[AID] 
Target
Name:
Multidrug resistance-associated protein 1
Synonyms:
7.6.2.2 ABCC1 ATP-binding cassette, sub-family C, member 1 isoform 1 LTC4 transporter MRP MRP1_HUMAN
Type:
Mol. Mass.:
171597.72
Organism:
Homo sapiens (Human)
Description:
P33527
Residue:
1531
  
Inhibitor
Name:
BDBM44611
Synonyms:
4-[4-(4-chlorobenzyl)piperazino]-N-(5-ethyl-1,3,4-thiadiazol-2-yl)-4-keto-butyramide 4-[4-[(4-chlorophenyl)methyl]piperazin-1-yl]-N-(5-ethyl-1,3,4-thiadiazol-2-yl)-4-oxidanylidene-butanamide MLS000082900 cid_664649
Type:
Small organic molecule
Emp. Form.:
C19H24ClN5O2S
Mol. Mass.:
421.944
SMILES:
CCc1nnc(NC(=O)CCC(=O)N2CCN(Cc3ccc(Cl)cc3)CC2)s1
: