Target
Multidrug resistance-associated protein 1
Ligand
BDBM44612
Substrate
Meas. Tech.
Identification of Molecular Probes that Activate MRP-1 - Dose Response
EC50
7933±n/a nM
Citation
 PubChem, PC Identification of Molecular Probes that Activate MRP-1 - Dose Response PubChem Bioassay (2007)[AID] 
Target
Name:
Multidrug resistance-associated protein 1
Synonyms:
7.6.2.2 ABCC1 ATP-binding cassette, sub-family C, member 1 isoform 1 LTC4 transporter MRP MRP1_HUMAN
Type:
Mol. Mass.:
171597.72
Organism:
Homo sapiens (Human)
Description:
P33527
Residue:
1531
  
Inhibitor
Name:
BDBM44612
Synonyms:
2,2-dimethyl-N-[(2-oxidanylidene-1H-quinolin-3-yl)methyl]-N-propan-2-yl-propanamide MLS000041025 SMR000046166 | cid_665112
Type:
Small organic molecule
Emp. Form.:
C18H24N2O2
Mol. Mass.:
300.3954
SMILES:
CC(C)N(Cc1cc2ccccc2[nH]c1=O)C(=O)C(C)(C)C
: