Target
Multidrug resistance-associated protein 1
Ligand
BDBM44618
Substrate
Meas. Tech.
Identification of Molecular Probes that Activate MRP-1 - Dose Response
EC50
3212±n/a nM
Citation
 PubChem, PC Identification of Molecular Probes that Activate MRP-1 - Dose Response PubChem Bioassay (2007)[AID] 
Target
Name:
Multidrug resistance-associated protein 1
Synonyms:
7.6.2.2 ABCC1 ATP-binding cassette, sub-family C, member 1 isoform 1 LTC4 transporter MRP MRP1_HUMAN
Type:
Mol. Mass.:
171597.72
Organism:
Homo sapiens (Human)
Description:
P33527
Residue:
1531
  
Inhibitor
Name:
BDBM44618
Synonyms:
1',3',9-trimethylspiro[1,2,3,4,4a,6-hexahydroquinolino[3,2-c]quinolizine-5,5'-1,3-diazinane]-2',4',6'-trione MLS000083677 cid_666387
Type:
Small organic molecule
Emp. Form.:
C22H24N4O3
Mol. Mass.:
392.451
SMILES:
CN1C(=O)N(C)C(=O)C2(Cc3cc4cc(C)ccc4nc3N3CCCCC23)C1=O
: