Target
Multidrug resistance-associated protein 1
Ligand
BDBM44625
Substrate
Meas. Tech.
Identification of Molecular Probes that Activate MRP-1 - Dose Response
EC50
6355±n/a nM
Citation
 PubChem, PC Identification of Molecular Probes that Activate MRP-1 - Dose Response PubChem Bioassay (2007)[AID] 
Target
Name:
Multidrug resistance-associated protein 1
Synonyms:
7.6.2.2 ABCC1 ATP-binding cassette, sub-family C, member 1 isoform 1 LTC4 transporter MRP MRP1_HUMAN
Type:
Mol. Mass.:
171597.72
Organism:
Homo sapiens (Human)
Description:
P33527
Residue:
1531
  
Inhibitor
Name:
BDBM44625
Synonyms:
MLS000098706 N-(4-methylphenyl)-4-[(1-methyltetrazol-5-yl)sulfanylmethyl]-1,3-thiazol-2-amine SMR000063762 cid_2997993
Type:
Small organic molecule
Emp. Form.:
C13H14N6S2
Mol. Mass.:
318.42
SMILES:
Cc1ccc(Nc2nc(CSc3nnnn3C)cs2)cc1
: