Target
Multidrug resistance-associated protein 1
Ligand
BDBM44626
Substrate
Meas. Tech.
Identification of Molecular Probes that Activate MRP-1 - Dose Response
EC50
5593±n/a nM
Citation
 PubChem, PC Identification of Molecular Probes that Activate MRP-1 - Dose Response PubChem Bioassay (2007)[AID] 
Target
Name:
Multidrug resistance-associated protein 1
Synonyms:
7.6.2.2 ABCC1 ATP-binding cassette, sub-family C, member 1 isoform 1 LTC4 transporter MRP MRP1_HUMAN
Type:
Mol. Mass.:
171597.72
Organism:
Homo sapiens (Human)
Description:
P33527
Residue:
1531
  
Inhibitor
Name:
BDBM44626
Synonyms:
2-[(4-keto-6-methyl-2,3-dihydro-1H-cyclopenta[c]chromen-7-yl)oxy]acetic acid tert-butyl ester MLS000054232 cid_2998135 tert-butyl 2-[(6-methyl-4-oxo-2,3-dihydro-1H-cyclopenta[c]chromen-7-yl)oxy]acetate
Type:
Small organic molecule
Emp. Form.:
C19H22O5
Mol. Mass.:
330.375
SMILES:
Cc1c(OCC(=O)OC(C)(C)C)ccc2c3CCCc3c(=O)oc12
: