Target
Multidrug resistance-associated protein 1
Ligand
BDBM44629
Substrate
Meas. Tech.
Identification of Molecular Probes that Activate MRP-1 - Dose Response
EC50
4941±n/a nM
Citation
 PubChem, PC Identification of Molecular Probes that Activate MRP-1 - Dose Response PubChem Bioassay (2007)[AID] 
Target
Name:
Multidrug resistance-associated protein 1
Synonyms:
7.6.2.2 ABCC1 ATP-binding cassette, sub-family C, member 1 isoform 1 LTC4 transporter MRP MRP1_HUMAN
Type:
Mol. Mass.:
171597.72
Organism:
Homo sapiens (Human)
Description:
P33527
Residue:
1531
  
Inhibitor
Name:
BDBM44629
Synonyms:
5-amino-1-(2-pyridinyl)-4-pyrazolecarboxylic acid ethyl ester MLS000057957 cid_742041 ethyl 5-azanyl-1-pyridin-2-yl-pyrazole-4-carboxylate
Type:
Small organic molecule
Emp. Form.:
C11H12N4O2
Mol. Mass.:
232.2386
SMILES:
CCOC(=O)c1cnn(c1N)-c1ccccn1
: