Target
Multidrug resistance-associated protein 1
Ligand
BDBM44630
Substrate
Meas. Tech.
Identification of Molecular Probes that Activate MRP-1 - Dose Response
EC50
7253±n/a nM
Citation
 PubChem, PC Identification of Molecular Probes that Activate MRP-1 - Dose Response PubChem Bioassay (2007)[AID] 
Target
Name:
Multidrug resistance-associated protein 1
Synonyms:
7.6.2.2 ABCC1 ATP-binding cassette, sub-family C, member 1 isoform 1 LTC4 transporter MRP MRP1_HUMAN
Type:
Mol. Mass.:
171597.72
Organism:
Homo sapiens (Human)
Description:
P33527
Residue:
1531
  
Inhibitor
Name:
BDBM44630
Synonyms:
2-[2-[2,4-bis(oxidanylidene)-1,3-diazaspiro[4.6]undecan-3-yl]ethanoylamino]-N-(4-bromanyl-2-methyl-phenyl)ethanamide N-(4-bromo-2-methyl-phenyl)-2-[[2-(2,4-diketo-1,3-diazaspiro[4.6]undecan-3-yl)acetyl]amino]acetamide N-(4-bromo-2-methylphenyl)-2-[[2-(2,4-dioxo-1,3-diazaspiro[4.6]undecan-3-yl)acetyl]amino]acetamide cid_2578429
Type:
Small organic molecule
Emp. Form.:
C20H25BrN4O4
Mol. Mass.:
465.341
SMILES:
Cc1cc(Br)ccc1NC(=O)CNC(=O)CN1C(=O)NC2(CCCCCC2)C1=O
: