Target
Multidrug resistance-associated protein 1
Ligand
BDBM44632
Substrate
Meas. Tech.
Identification of Molecular Probes that Activate MRP-1 - Dose Response
EC50
5690±n/a nM
Citation
 PubChem, PC Identification of Molecular Probes that Activate MRP-1 - Dose Response PubChem Bioassay (2007)[AID] 
Target
Name:
Multidrug resistance-associated protein 1
Synonyms:
7.6.2.2 ABCC1 ATP-binding cassette, sub-family C, member 1 isoform 1 LTC4 transporter MRP MRP1_HUMAN
Type:
Mol. Mass.:
171597.72
Organism:
Homo sapiens (Human)
Description:
P33527
Residue:
1531
  
Inhibitor
Name:
BDBM44632
Synonyms:
2-bromanyl-N-(5-methyl-1,3,4-thiadiazol-2-yl)benzamide MLS000054409 cid_739348
Type:
Small organic molecule
Emp. Form.:
C10H8BrN3OS
Mol. Mass.:
298.159
SMILES:
Cc1nnc(NC(=O)c2ccccc2Br)s1
: