Target
Multidrug resistance-associated protein 1
Ligand
BDBM44633
Substrate
Meas. Tech.
Identification of Molecular Probes that Activate MRP-1 - Dose Response
EC50
4423±n/a nM
Citation
 PubChem, PC Identification of Molecular Probes that Activate MRP-1 - Dose Response PubChem Bioassay (2007)[AID] 
Target
Name:
Multidrug resistance-associated protein 1
Synonyms:
7.6.2.2 ABCC1 ATP-binding cassette, sub-family C, member 1 isoform 1 LTC4 transporter MRP MRP1_HUMAN
Type:
Mol. Mass.:
171597.72
Organism:
Homo sapiens (Human)
Description:
P33527
Residue:
1531
  
Inhibitor
Name:
BDBM44633
Synonyms:
2-[(2-benzyl-3-keto-isoindolin-1-yl)thio]acetic acid 2-[[3-oxidanylidene-2-(phenylmethyl)-1H-isoindol-1-yl]sulfanyl]ethanoic acid MLS000055419 cid_2998770
Type:
Small organic molecule
Emp. Form.:
C17H15NO3S
Mol. Mass.:
313.371
SMILES:
OC(=O)CSC1N(Cc2ccccc2)C(=O)c2ccccc12
: