Target
Multidrug resistance-associated protein 1
Ligand
BDBM44634
Substrate
Meas. Tech.
Identification of Molecular Probes that Activate MRP-1 - Dose Response
EC50
6415±n/a nM
Citation
 PubChem, PC Identification of Molecular Probes that Activate MRP-1 - Dose Response PubChem Bioassay (2007)[AID] 
Target
Name:
Multidrug resistance-associated protein 1
Synonyms:
7.6.2.2 ABCC1 ATP-binding cassette, sub-family C, member 1 isoform 1 LTC4 transporter MRP MRP1_HUMAN
Type:
Mol. Mass.:
171597.72
Organism:
Homo sapiens (Human)
Description:
P33527
Residue:
1531
  
Inhibitor
Name:
BDBM44634
Synonyms:
3-(2-chlorophenyl)-5-methyl-4-isoxazolecarboxylic acid [2-(1,3-benzodioxol-5-ylamino)-2-oxoethyl] ester MLS000057798 [2-(1,3-benzodioxol-5-ylamino)-2-oxidanylidene-ethyl] 3-(2-chlorophenyl)-5-methyl-1,2-oxazole-4-carboxylate cid_2083749
Type:
Small organic molecule
Emp. Form.:
C20H15ClN2O6
Mol. Mass.:
414.796
SMILES:
Cc1onc(c1C(=O)OCC(=O)Nc1ccc2OCOc2c1)-c1ccccc1Cl
: