Target
Multidrug resistance-associated protein 1
Ligand
BDBM29631
Substrate
Meas. Tech.
Identification of Molecular Probes that Activate MRP-1 - Dose Response
EC50
3165±n/a nM
Citation
 PubChem, PC Identification of Molecular Probes that Activate MRP-1 - Dose Response PubChem Bioassay (2007)[AID] 
Target
Name:
Multidrug resistance-associated protein 1
Synonyms:
7.6.2.2 ABCC1 ATP-binding cassette, sub-family C, member 1 isoform 1 LTC4 transporter MRP MRP1_HUMAN
Type:
Mol. Mass.:
171597.72
Organism:
Homo sapiens (Human)
Description:
P33527
Residue:
1531
  
Inhibitor
Name:
BDBM29631
Synonyms:
MLS000082179 [3-amino-4-(1,3-benzothiazol-2-yl)-5-(ethylamino)-2-thienyl]-(2-thienyl)methanone [3-amino-4-(1,3-benzothiazol-2-yl)-5-(ethylamino)thiophen-2-yl]-thiophen-2-ylmethanone cid_2998964
Type:
Small organic molecule
Emp. Form.:
C18H15N3OS3
Mol. Mass.:
385.526
SMILES:
CCNc1sc(C(=O)c2cccs2)c(N)c1-c1nc2ccccc2s1
: