Target
Multidrug resistance-associated protein 1
Ligand
BDBM44636
Substrate
Meas. Tech.
Identification of Molecular Probes that Activate MRP-1 - Dose Response
EC50
5701±n/a nM
Citation
 PubChem, PC Identification of Molecular Probes that Activate MRP-1 - Dose Response PubChem Bioassay (2007)[AID] 
Target
Name:
Multidrug resistance-associated protein 1
Synonyms:
7.6.2.2 ABCC1 ATP-binding cassette, sub-family C, member 1 isoform 1 LTC4 transporter MRP MRP1_HUMAN
Type:
Mol. Mass.:
171597.72
Organism:
Homo sapiens (Human)
Description:
P33527
Residue:
1531
  
Inhibitor
Name:
BDBM44636
Synonyms:
1,3-benzodioxole-5-carboxylic acid [2-[2,5-dimethyl-1-(thiophen-2-ylmethyl)-3-pyrrolyl]-2-oxoethyl] ester SMR000063594 [2-[2,5-dimethyl-1-(thiophen-2-ylmethyl)pyrrol-3-yl]-2-oxoethyl] 1,3-benzodioxole-5-carboxylate piperonylic acid [2-[2,5-dimethyl-1-(2-thenyl)pyrrol-3-yl]-2-keto-ethyl] ester
Type:
Small organic molecule
Emp. Form.:
C21H19NO5S
Mol. Mass.:
397.444
SMILES:
Cc1cc(C(=O)COC(=O)c2ccc3OCOc3c2)c(C)n1Cc1cccs1
: