Target
Multidrug resistance-associated protein 1
Ligand
BDBM44638
Substrate
Meas. Tech.
Identification of Molecular Probes that Activate MRP-1 - Dose Response
EC50
6410±n/a nM
Citation
 PubChem, PC Identification of Molecular Probes that Activate MRP-1 - Dose Response PubChem Bioassay (2007)[AID] 
Target
Name:
Multidrug resistance-associated protein 1
Synonyms:
7.6.2.2 ABCC1 ATP-binding cassette, sub-family C, member 1 isoform 1 LTC4 transporter MRP MRP1_HUMAN
Type:
Mol. Mass.:
171597.72
Organism:
Homo sapiens (Human)
Description:
P33527
Residue:
1531
  
Inhibitor
Name:
BDBM44638
Synonyms:
3-(1-benzofuran-2-yl)-2-(4-methyl-1,3-thiazol-2-yl)-3-oxidanylidene-propanenitrile 3-(2-benzofuranyl)-2-(4-methyl-2-thiazolyl)-3-oxopropanenitrile MLS000097996 cid_2999537
Type:
Small organic molecule
Emp. Form.:
C15H10N2O2S
Mol. Mass.:
282.317
SMILES:
Cc1csc(n1)C(C#N)C(=O)c1cc2ccccc2o1
: