Target
Multidrug resistance-associated protein 1
Ligand
BDBM44639
Substrate
Meas. Tech.
Identification of Molecular Probes that Activate MRP-1 - Dose Response
EC50
5317±n/a nM
Citation
 PubChem, PC Identification of Molecular Probes that Activate MRP-1 - Dose Response PubChem Bioassay (2007)[AID] 
Target
Name:
Multidrug resistance-associated protein 1
Synonyms:
7.6.2.2 ABCC1 ATP-binding cassette, sub-family C, member 1 isoform 1 LTC4 transporter MRP MRP1_HUMAN
Type:
Mol. Mass.:
171597.72
Organism:
Homo sapiens (Human)
Description:
P33527
Residue:
1531
  
Inhibitor
Name:
BDBM44639
Synonyms:
2,6-dimethyl-4-[2-[(4-methyl-2-oxido-1,2,5-oxadiazol-2-ium-3-yl)methoxy]phenyl]-1,4-dihydropyridine-3,5-dicarboxylic acid dimethyl ester MLS000054505 cid_2999719 dimethyl 2,6-dimethyl-4-[2-[(4-methyl-2-oxido-1,2,5-oxadiazol-2-ium-3-yl)methoxy]phenyl]-1,4-dihydropyridine-3,5-dicarboxylate
Type:
Small organic molecule
Emp. Form.:
C21H23N3O7
Mol. Mass.:
429.4232
SMILES:
COC(=O)C1C(C(C(=O)OC)=C(C)N=C1C)c1ccccc1OCc1c(C)n[o+]n1[O-]
: