Target
Multidrug resistance-associated protein 1
Ligand
BDBM44640
Substrate
Meas. Tech.
Identification of Molecular Probes that Activate MRP-1 - Dose Response
EC50
4877±n/a nM
Citation
 PubChem, PC Identification of Molecular Probes that Activate MRP-1 - Dose Response PubChem Bioassay (2007)[AID] 
Target
Name:
Multidrug resistance-associated protein 1
Synonyms:
7.6.2.2 ABCC1 ATP-binding cassette, sub-family C, member 1 isoform 1 LTC4 transporter MRP MRP1_HUMAN
Type:
Mol. Mass.:
171597.72
Organism:
Homo sapiens (Human)
Description:
P33527
Residue:
1531
  
Inhibitor
Name:
BDBM44640
Synonyms:
4-(1-azepanylsulfonyl)-N-(5-ethyl-1,3,4-thiadiazol-2-yl)benzamide MLS000098854 cid_1428603
Type:
Small organic molecule
Emp. Form.:
C17H22N4O3S2
Mol. Mass.:
394.512
SMILES:
CCc1nnc(NC(=O)c2ccc(cc2)S(=O)(=O)N2CCCCCC2)s1
: