Target
Multidrug resistance-associated protein 1
Ligand
BDBM44641
Substrate
Meas. Tech.
Identification of Molecular Probes that Activate MRP-1 - Dose Response
EC50
3033±n/a nM
Citation
 PubChem, PC Identification of Molecular Probes that Activate MRP-1 - Dose Response PubChem Bioassay (2007)[AID] 
Target
Name:
Multidrug resistance-associated protein 1
Synonyms:
7.6.2.2 ABCC1 ATP-binding cassette, sub-family C, member 1 isoform 1 LTC4 transporter MRP MRP1_HUMAN
Type:
Mol. Mass.:
171597.72
Organism:
Homo sapiens (Human)
Description:
P33527
Residue:
1531
  
Inhibitor
Name:
BDBM44641
Synonyms:
MLS000054117 [3-amino-4-(1,3-benzothiazol-2-yl)-5-(methylamino)-2-thienyl]-(2-thienyl)methanone [3-amino-4-(1,3-benzothiazol-2-yl)-5-(methylamino)thiophen-2-yl]-thiophen-2-ylmethanone cid_3000142
Type:
Small organic molecule
Emp. Form.:
C17H13N3OS3
Mol. Mass.:
371.5
SMILES:
CNc1sc(C(=O)c2cccs2)c(N)c1-c1nc2ccccc2s1
: