Target
Multidrug resistance-associated protein 1
Ligand
BDBM44642
Substrate
Meas. Tech.
Identification of Molecular Probes that Activate MRP-1 - Dose Response
EC50
4427±n/a nM
Citation
 PubChem, PC Identification of Molecular Probes that Activate MRP-1 - Dose Response PubChem Bioassay (2007)[AID] 
Target
Name:
Multidrug resistance-associated protein 1
Synonyms:
7.6.2.2 ABCC1 ATP-binding cassette, sub-family C, member 1 isoform 1 LTC4 transporter MRP MRP1_HUMAN
Type:
Mol. Mass.:
171597.72
Organism:
Homo sapiens (Human)
Description:
P33527
Residue:
1531
  
Inhibitor
Name:
BDBM44642
Synonyms:
4-[[4-(tert-butylamino)-6-(dimethylamino)-1,3,5-triazin-2-yl]oxy]benzoic acid ethyl ester MLS000085444 cid_3236720 ethyl 4-{[4-(tert-butylamino)-6-(dimethylamino)-1,3,5-triazin-2-yl]oxy}benzoate
Type:
Small organic molecule
Emp. Form.:
C18H25N5O3
Mol. Mass.:
359.4228
SMILES:
CCOC(=O)c1ccc(Oc2nc(NC(C)(C)C)nc(n2)N(C)C)cc1
: