Target
Multidrug resistance-associated protein 1
Ligand
BDBM44643
Substrate
Meas. Tech.
Identification of Molecular Probes that Activate MRP-1 - Dose Response
EC50
3324±n/a nM
Citation
 PubChem, PC Identification of Molecular Probes that Activate MRP-1 - Dose Response PubChem Bioassay (2007)[AID] 
Target
Name:
Multidrug resistance-associated protein 1
Synonyms:
7.6.2.2 ABCC1 ATP-binding cassette, sub-family C, member 1 isoform 1 LTC4 transporter MRP MRP1_HUMAN
Type:
Mol. Mass.:
171597.72
Organism:
Homo sapiens (Human)
Description:
P33527
Residue:
1531
  
Inhibitor
Name:
BDBM44643
Synonyms:
3-cyclohexyl-5-(2-pyridin-4-yl-4-quinolinyl)-1,2,4-oxadiazole 3-cyclohexyl-5-[2-(4-pyridyl)-4-quinolyl]-1,2,4-oxadiazole MLS000095717 cid_3236759
Type:
Small organic molecule
Emp. Form.:
C22H20N4O
Mol. Mass.:
356.4204
SMILES:
C1CCC(CC1)c1noc(n1)-c1cc(nc2ccccc12)-c1ccncc1
: