Target
Multidrug resistance-associated protein 1
Ligand
BDBM44644
Substrate
Meas. Tech.
Identification of Molecular Probes that Activate MRP-1 - Dose Response
EC50
2786±n/a nM
Citation
 PubChem, PC Identification of Molecular Probes that Activate MRP-1 - Dose Response PubChem Bioassay (2007)[AID] 
Target
Name:
Multidrug resistance-associated protein 1
Synonyms:
7.6.2.2 ABCC1 ATP-binding cassette, sub-family C, member 1 isoform 1 LTC4 transporter MRP MRP1_HUMAN
Type:
Mol. Mass.:
171597.72
Organism:
Homo sapiens (Human)
Description:
P33527
Residue:
1531
  
Inhibitor
Name:
BDBM44644
Synonyms:
1-keto-2-nicotinamido-isoquinoline-4-carboxylic acid methyl ester MLS000044459 cid_3236769 methyl 1-oxo-2-(pyridine-3-carbonylamino)isoquinoline-4-carboxylate | methyl 1-oxo-2-[(pyridin-3-ylcarbonyl)amino]-1,2-dihydroisoquinoline-4-carboxylate
Type:
Small organic molecule
Emp. Form.:
C17H13N3O4
Mol. Mass.:
323.3028
SMILES:
COC(=O)c1cn(NC(=O)c2cccnc2)c(=O)c2ccccc12
: