Target
Multidrug resistance-associated protein 1
Ligand
BDBM34606
Substrate
Meas. Tech.
Identification of Molecular Probes that Activate MRP-1 - Dose Response
EC50
5166±n/a nM
Citation
 PubChem, PC Identification of Molecular Probes that Activate MRP-1 - Dose Response PubChem Bioassay (2007)[AID] 
Target
Name:
Multidrug resistance-associated protein 1
Synonyms:
7.6.2.2 ABCC1 ATP-binding cassette, sub-family C, member 1 isoform 1 LTC4 transporter MRP MRP1_HUMAN
Type:
Mol. Mass.:
171597.72
Organism:
Homo sapiens (Human)
Description:
P33527
Residue:
1531
  
Inhibitor
Name:
BDBM34606
Synonyms:
1-(4-isopropylphenyl)-2-(4H-1,2,4-triazol-3-ylthio)ethanone 1-(4-propan-2-ylphenyl)-2-(1H-1,2,4-triazol-5-ylthio)ethanone MLS000089862 cid_715443
Type:
Small organic molecule
Emp. Form.:
C13H15N3OS
Mol. Mass.:
261.343
SMILES:
CC(C)c1ccc(cc1)C(=O)CSc1nnc[nH]1
: