Target
Tyrosine-protein phosphatase non-receptor type 7
Ligand
BDBM46179
Substrate
Meas. Tech.
Fluorescent secondary assay for dose-response confirmation of chemical inhibitors of HePTP
IC50
3458±n/a nM
Citation
 PubChem, PC Fluorescent secondary assay for dose-response confirmation of chemical inhibitors of HePTP PubChem Bioassay (2009)[AID] 
Target
Name:
Tyrosine-protein phosphatase non-receptor type 7
Synonyms:
He-PTP Hematopoietic protein-tyrosine phosphatase (HEPTP) PTPN7 Tyrosine-protein phosphatase non-receptor type 7 | Tyrosine-protein phosphatase non-receptor type 7 (HEPTP)
Type:
Protein
Mol. Mass.:
40530.79
Organism:
Homo sapiens (Human)
Description:
P35236
Residue:
360
  
Inhibitor
Name:
BDBM46179
Synonyms:
MLS-0202043.0001 N-[2,3-bis(2-furyl)quinoxalin-6-yl]thiomorpholine-4-carboxamide cid_24178215
Type:
Small organic molecule
Emp. Form.:
C21H18N4O3S
Mol. Mass.:
406.458
SMILES:
O=C(Nc1ccc2nc(-c3ccco3)c(nc2c1)-c1ccco1)N1CCSCC1
: