Target
Serine/threonine-protein kinase D1
Ligand
BDBM32346
Substrate
Meas. Tech.
Fluorescence polarization assay for PKD inhibitiors-interference assay-57K HTS campaign
IC50
>50000±n/a nM
Citation
 PubChem, PC Fluorescence polarization assay for PKD inhibitiors-interference assay-57K HTS campaign PubChem Bioassay (2008)[AID] 
Target
Name:
Serine/threonine-protein kinase D1
Synonyms:
KPCD1_HUMAN PKD1 PRKD1 Protein kinase C mu type Protein kinase C, PKC; classical/novel Protein kinase D (PRKD1) nPKC-D1 | nPKC-mu
Type:
Serine/threonine-protein kinase
Mol. Mass.:
101705.07
Organism:
Homo sapiens (Human)
Description:
gi_115529463
Residue:
912
  
Inhibitor
Name:
BDBM32346
Synonyms:
2-[(3-methoxycarbonyl-5,6,7,8-tetrahydro-4H-cyclohepta[b]thiophen-2-yl)carbamoyl]bicyclo[2.2.1]heptane-3-carboxylic acid 3-({[3-(methoxycarbonyl)-5,6,7,8-tetrahydro-4H-cyclohepta[b]thien-2-yl]amino}carbonyl)bicyclo[2.2.1]heptane-2-carboxylic acid MLS000673690 cid_2887468
Type:
Small organic molecule
Emp. Form.:
C20H25NO5S
Mol. Mass.:
391.481
SMILES:
[H]C12CCC([H])(C1)C(C2C(O)=O)C(=O)Nc1sc2CCCCCc2c1C(=O)OC
: