Target
Serine/threonine-protein kinase D1
Ligand
BDBM32352
Substrate
Meas. Tech.
Fluorescence polarization assay for PKD inhibitiors-interference assay-57K HTS campaign
IC50
>50000±n/a nM
Citation
 PubChem, PC Fluorescence polarization assay for PKD inhibitiors-interference assay-57K HTS campaign PubChem Bioassay (2008)[AID] 
Target
Name:
Serine/threonine-protein kinase D1
Synonyms:
KPCD1_HUMAN PKD1 PRKD1 Protein kinase C mu type Protein kinase C, PKC; classical/novel Protein kinase D (PRKD1) nPKC-D1 | nPKC-mu
Type:
Serine/threonine-protein kinase
Mol. Mass.:
101705.07
Organism:
Homo sapiens (Human)
Description:
gi_115529463
Residue:
912
  
Inhibitor
Name:
BDBM32352
Synonyms:
2-(3-besylpropanoylimino)-3,4-dimethyl-4-thiazoline-5-carboxylic acid ethyl ester MLS000624279 cid_7243149 ethyl 3,4-dimethyl-2-[3-(phenylsulfonyl)propanoylimino]-1,3-thiazole-5-carboxylate
Type:
Small organic molecule
Emp. Form.:
C17H20N2O5S2
Mol. Mass.:
396.481
SMILES:
CCOC(=O)c1sc(=NC(=O)CCS(=O)(=O)c2ccccc2)n(C)c1C
: