Target
Serine/threonine-protein kinase D1
Ligand
BDBM32353
Substrate
Meas. Tech.
Fluorescence polarization assay for PKD inhibitiors-interference assay-57K HTS campaign
IC50
>50000±n/a nM
Citation
 PubChem, PC Fluorescence polarization assay for PKD inhibitiors-interference assay-57K HTS campaign PubChem Bioassay (2008)[AID] 
Target
Name:
Serine/threonine-protein kinase D1
Synonyms:
KPCD1_HUMAN PKD1 PRKD1 Protein kinase C mu type Protein kinase C, PKC; classical/novel Protein kinase D (PRKD1) nPKC-D1 | nPKC-mu
Type:
Serine/threonine-protein kinase
Mol. Mass.:
101705.07
Organism:
Homo sapiens (Human)
Description:
gi_115529463
Residue:
912
  
Inhibitor
Name:
BDBM32353
Synonyms:
3-(2,5-dichlorophenyl)-1,3-thiazolan-4-one 3-(2,5-dichlorophenyl)-4-thiazolidinone 3-[2,5-bis(chloranyl)phenyl]-1,3-thiazolidin-4-one SMR000333127 | cid_1478350
Type:
Small organic molecule
Emp. Form.:
C9H7Cl2NOS
Mol. Mass.:
248.129
SMILES:
Clc1ccc(Cl)c(c1)N1CSCC1=O
: