Target
Serine/threonine-protein kinase D1
Ligand
BDBM32359
Substrate
Meas. Tech.
Fluorescence polarization assay for PKD inhibitiors-interference assay-57K HTS campaign
IC50
>50000±n/a nM
Citation
 PubChem, PC Fluorescence polarization assay for PKD inhibitiors-interference assay-57K HTS campaign PubChem Bioassay (2008)[AID] 
Target
Name:
Serine/threonine-protein kinase D1
Synonyms:
KPCD1_HUMAN PKD1 PRKD1 Protein kinase C mu type Protein kinase C, PKC; classical/novel Protein kinase D (PRKD1) nPKC-D1 | nPKC-mu
Type:
Serine/threonine-protein kinase
Mol. Mass.:
101705.07
Organism:
Homo sapiens (Human)
Description:
gi_115529463
Residue:
912
  
Inhibitor
Name:
BDBM32359
Synonyms:
MLS000772778 N-(2-naphthyl)-2-(4-pyridylthio)acetamide N-naphthalen-2-yl-2-pyridin-4-ylsulfanylacetamide cid_2103808
Type:
Small organic molecule
Emp. Form.:
C17H14N2OS
Mol. Mass.:
294.371
SMILES:
O=C(CSc1ccncc1)Nc1ccc2ccccc2c1
: