Target
Gag-Pol polyprotein [600-1027,R876K]/[600-1155]
Ligand
BDBM2048
Substrate
poly(rC)500:oligo(dG)10
Meas. Tech.
HIV-1 RT Assay
IC50
40±n/a nM
Citation
 Cywin, CLKlunder, JMHoermann, MBrickwood, JRDavid, EGrob, PMSchwartz, RPauletti, DBarringer, KJShih, CKSorge, CLErickson, DAJoseph, DPHattox, SE Novel Nonnucleoside Inhibitors of HIV-1 Reverse Transcriptase. 8. 8-Aryloxymethyl- and 8-Arylthiomethyldipyridodiazepinones J Med Chem 41:2972-84 (1998)  
Target
Name:
Gag-Pol polyprotein [600-1027,R876K]/[600-1155]
Synonyms:
EC: 2.7.7.49 | HIV-1 Reverse Transcriptase
Type:
Protein Complex
Mol. Mass.:
113858
Description:
Components:
This complex has 2 components.
Component 1
Name:
Gag-Pol polyprotein [600-1155]
Synonyms:
HIV-1 Reverse Transcriptase Chain A gag-pol
Type:
Enzyme Subunit
Mol. Mass.:
63928.81
Organism:
Human immunodeficiency virus type 1
Description:
P03366[600-1155]
Residue:
556
  
Component 2
Name:
Gag-Pol polyprotein [600-1027,R876K]
Synonyms:
HIV-1 Reverse Transcriptase Chain B gag-pol
Type:
Enzyme Subunit
Mol. Mass.:
49968.63
Organism:
Human immunodeficiency virus type 1
Description:
P03366[600-1027,R876K]
Residue:
428
  
Inhibitor
Name:
BDBM2048
Synonyms:
2,8-disubstituted dipyridodiazepinone 31 5-chloro-2-ethyl-9-methyl-13-({[2-(trifluoromethyl)pyridin-4-yl]oxy}methyl)-2,4,9,15-tetraazatricyclo[9.4.0.0^{3,8}]pentadeca-1(11),3,5,7,12,14-hexaen-10-one
Type:
Small organic molecule
Emp. Form.:
C21H17ClF3N5O2
Mol. Mass.:
463.84
SMILES:
CCN1c2nc(Cl)ccc2N(C)C(=O)c2cc(COc3ccnc(c3)C(F)(F)F)cnc12
:
Substrate
Name:
poly(rC)500:oligo(dG)10
Synonyms:
Type:
RNA\DNA duplex
Mol. Mass.:
358.43
Organism:
Description:
The incorporation of Tritium-labeled dGTP onto a (poly)rC:(oligo)dG template:primer.
Residue:
3
NA