Target
Gag-Pol polyprotein [600-1027,R876K]/[600-1155]
Ligand
BDBM2058
Substrate
poly(rC)500:oligo(dG)10
Meas. Tech.
HIV-1 RT Assay
IC50
20±n/a nM
Citation
 Cywin, CLKlunder, JMHoermann, MBrickwood, JRDavid, EGrob, PMSchwartz, RPauletti, DBarringer, KJShih, CKSorge, CLErickson, DAJoseph, DPHattox, SE Novel Nonnucleoside Inhibitors of HIV-1 Reverse Transcriptase. 8. 8-Aryloxymethyl- and 8-Arylthiomethyldipyridodiazepinones J Med Chem 41:2972-84 (1998)  
Target
Name:
Gag-Pol polyprotein [600-1027,R876K]/[600-1155]
Synonyms:
EC: 2.7.7.49 | HIV-1 Reverse Transcriptase
Type:
Protein Complex
Mol. Mass.:
113858
Description:
Components:
This complex has 2 components.
Component 1
Name:
Gag-Pol polyprotein [600-1155]
Synonyms:
HIV-1 Reverse Transcriptase Chain A gag-pol
Type:
Enzyme Subunit
Mol. Mass.:
63928.81
Organism:
Human immunodeficiency virus type 1
Description:
P03366[600-1155]
Residue:
556
  
Component 2
Name:
Gag-Pol polyprotein [600-1027,R876K]
Synonyms:
HIV-1 Reverse Transcriptase Chain B gag-pol
Type:
Enzyme Subunit
Mol. Mass.:
49968.63
Organism:
Human immunodeficiency virus type 1
Description:
P03366[600-1027,R876K]
Residue:
428
  
Inhibitor
Name:
BDBM2058
Synonyms:
2,8-disubstituted dipyridodiazepinone 41 5-chloro-2-ethyl-9-methyl-13-[(pyridin-4-ylsulfanyl)methyl]-2,4,9,15-tetraazatricyclo[9.4.0.0^{3,8}]pentadeca-1(15),3(8),4,6,11,13-hexaen-10-one | 8-heteroarylthiomethyldipyridodiazepinone deriv. 1
Type:
Small organic molecule
Emp. Form.:
C20H18ClN5OS
Mol. Mass.:
411.908
SMILES:
CCN1c2nc(Cl)ccc2N(C)C(=O)c2cc(CSc3ccncc3)cnc12
:
Substrate
Name:
poly(rC)500:oligo(dG)10
Synonyms:
Type:
RNA\DNA duplex
Mol. Mass.:
358.43
Organism:
Description:
The incorporation of Tritium-labeled dGTP onto a (poly)rC:(oligo)dG template:primer.
Residue:
3
NA