Target
Eukaryotic translation initiation factor 2-alpha kinase 3
Ligand
BDBM46513
Substrate
Meas. Tech.
Counterscreen assay for PERK inhibitors: Dose response cell-based high throughput screening assay to measure inhibition of PERK at 6 hours
EC50
>55700±n/a nM
Citation
 PubChem, PC Counterscreen assay for PERK inhibitors: Dose response cell-based high throughput screening assay to measure inhibition of PERK at 6 hours PubChem Bioassay (2009)[AID] 
Target
Name:
Eukaryotic translation initiation factor 2-alpha kinase 3
Synonyms:
E2AK3_HUMAN HsPEK PERK Pancreatic endoplasmic reticulum kinase (PERK)
Type:
Enzyme
Mol. Mass.:
125190.66
Organism:
Homo sapiens (Human)
Description:
Q9NZJ5
Residue:
1116
  
Inhibitor
Name:
BDBM46513
Synonyms:
MLS000777856 N-[1-(4-phenyl-5-thioxo-1H-1,2,4-triazol-3-yl)ethyl]benzenesulfonamide SMR000414188 | cid_3323022
Type:
Small organic molecule
Emp. Form.:
C16H16N4O2S2
Mol. Mass.:
360.454
SMILES:
CC(NS(=O)(=O)c1ccccc1)c1n[nH]c(=S)n1-c1ccccc1
: